Issue with node-sass while compiling asset – npm

Issue I am getting this error on npm run prod npm run prod > @ prod /opt/atlassian/pipelines/agent/build > encore production Running webpack … ERROR Failed to compile with 2 errors4:15:08 PM error in ./web/assets/src/scss/styles.scss Module build failed: $navbar-padding-horizontal: floor(math.div($grid-gutter-width, 2))

Continue reading

Vue Js Installation

Issue Tried installing vue js through npm install -g @vue/cli. My npm version is 6.14.4 and node version is 12.16.2 This is the error i am getting npm WARN deprecated request@2.88.2: request has been deprecated, see https://github.com/request/request/issues/3142 npm ERR! Unexpected

Continue reading

-D in npm install

Issue While installing react-router-dom, I came across a term -D in it, npm i -D react-router-dom@latest When I surfed online I came to know that it is -d: –loglevel info. I need to know what exactly does this -d do

Continue reading

bento-ng-d3 not found on registry.npmjs.org and some other bento packages as well, Angular

Issue I have found the following dependency in my angular project package.json file. "@bento/bento-ng":"8.4.1", "@bento/bento-ng-d3":8.4.1, "@bento/bento-ng-datamap":8.4.1, "@bento/bento-ng-flexgrid-control":8.4.1, "@bento/bento-ng-transferbox":8.4.1 Tried npm install, yarn install but nothing helps out in installing these packages, I always get the same error error: An unexpected

Continue reading

I can't install npm install –save react-tilt

Issue C:\Users\JohnSam\Desktop\React\smartapp>npm install –save react-tilt npm ERR! code ERESOLVE npm ERR! ERESOLVE unable to resolve dependency tree npm ERR! npm ERR! While resolving: smartbrain2@0.1.0 npm ERR! Found: react@17.0.2 npm ERR! node_modules/react npm ERR! react@"^17.0.2" from the root project npm ERR!

Continue reading

npm packages requires Angular 2 and 4

Issue In pacakge.json, there are 2 npm libraries that requires 2 different versions of Angular – ng2-translate and ngx-infinite-scroll. For ng2-translate, it only supports Angular 2, but for ngx-infinite-scroll, the lowest version supports Angular 4. peer @angular/common@">= 4.0.0" from ngx-infinite-scroll@0.4.0

Continue reading

npm packages requires Angular 2 and 4

Issue In pacakge.json, there are 2 npm libraries that requires 2 different versions of Angular – ng2-translate and ngx-infinite-scroll. For ng2-translate, it only supports Angular 2, but for ngx-infinite-scroll, the lowest version supports Angular 4. peer @angular/common@">= 4.0.0" from ngx-infinite-scroll@0.4.0

Continue reading

Installing create-react-app gives npm ERR! shasum check failed and npm ERR! Unexpected end of JSON input while parsing near '…mojOzGIEI2rg0m24Yb5Oq'

Issue Errors when i use sudo npm install create-react-app -g npm ERR! Linux 4.13.0-39-generic npm ERR! argv “/usr/bin/node” “/usr/bin/npm” “i” “create-react-app” “-g” npm ERR! node v6.11.4 npm ERR! npm v3.5.2 npm ERR! shasum check failed for /tmp/npm-16477-77596b49/registry.npmjs.org/tar/-/tar-2.2.1.tgz npm ERR! Expected:

Continue reading

Installing create-react-app gives npm ERR! shasum check failed and npm ERR! Unexpected end of JSON input while parsing near '…mojOzGIEI2rg0m24Yb5Oq'

Issue Errors when i use sudo npm install create-react-app -g npm ERR! Linux 4.13.0-39-generic npm ERR! argv “/usr/bin/node” “/usr/bin/npm” “i” “create-react-app” “-g” npm ERR! node v6.11.4 npm ERR! npm v3.5.2 npm ERR! shasum check failed for /tmp/npm-16477-77596b49/registry.npmjs.org/tar/-/tar-2.2.1.tgz npm ERR! Expected:

Continue reading

407 Authentication required npm

Issue Hello everyone I´ve been trying to configure and use npm on my enterprise PC without success. I´ve set proxy, https-proxy, strict-ssl false, registry http://registry.npmjs.org proxy has been set like this “http://user:password@proxy_ip:proxy:port” Where the password has a special character written

Continue reading

npm ERR! git dep preparation failed when trying to install package.json

Issue I’m trying to install package.json file using the command npm install, but I’m getting the following error. npm ERR! git dep preparation failed npm ERR! command C:\Program Files\nodejs\node.exe C:\Users\DHRUV\AppData\Roaming\npm\node_modules\npm\bin\npm-cli.js install –force –cache=C:\Users\DHRUV\AppData\Local\npm-cache –prefer-offline=false –prefer-online=false –offline=false –no-progress –no-save –no-audit npm

Continue reading

npm install errors on Ubuntu 20.04

Issue I am self-learning Angular and was trying to run this project: https://github.com/akveo/ngx-admin I downloaded the zip file and did npm install in VSCode’s Terminal. I am using Ubuntu 20.04 (LTS) and my Node and NPM versions are: ajay@linuxpc:~/Documents$ node

Continue reading

Overlay-navbar using npm overlay-navbar module?

Issue I am Creating a overlay-navbar using npm overlay-navbar module https://www.npmjs.com/package/overlay-navbar But I am getting a error: the requested module ‘./io5’ contains conflicting star exports for the names ‘iologoandroid’, ‘iologoangular’, ‘iologoapple’, ‘iologobitbucket’, ‘iologobitcoin’, ‘iologobuffer’, ‘iologochrome’, ‘iologoclosedcaptioning’, ‘iologocodepen’, ‘iologocss3’, ‘iologodesignernews’, ‘iologodribbble’,

Continue reading